3,7-Octadiene-2,6-diol, 2,6-dimethyl-

Van Den Dool and Kratz RI, non-polar column, temperature ramp

Data compiled by: NIST Mass Spectrometry Data Center, William E. Wallace, director

Column type CapillaryCapillaryCapillary
Active phase HP-101Equity-5DB-5MS
Column length (m) 25.60.30.
Carrier gas HeliumHeH2
Substrate
Column diameter (mm) 0.200.250.25
Phase thickness (μm) 0.201.0.25
Tstart (C) 70.40.40.
Tend (C) 200.260.200.
Heat rate (K/min) 3.5.2.
Initial hold (min) 2.1.
Final hold (min) 15.15.
I 1219.1199.1176.
ReferencePoliteo, Jukic, et al., 2007Rocha, Coelho, et al., 2007Chassagne, Boulanger, et al., 1999
Comment MSDC-RI MSDC-RI MSDC-RI

References

Politeo, Jukic, et al., 2007
Politeo, O.; Jukic, M.; Milos, M., Chemical Composition and Antioxidant Activity of Free Volatile Aglycones from Laurel (Laurus nobilis L.) Compared to Its Essential Oil, Croatica Chem. Acta, 2007, 80, 1, 121-126. [all data]

Rocha, Coelho, et al., 2007
Rocha, S.M.; Coelho, E.; Zrostlikova, J.; Delgadillo, I.; Coimbra b, M.A., Comprehensive two-dimensional gas chromatography with time-of-flight mass spectrometry of monoterpenoids as a powerful tool for grape origin traceability, J. Chromatogr. A, 2007, 1161, 1-2, 292-299, https://doi.org/10.1016/j.chroma.2007.05.093 . [all data]

Chassagne, Boulanger, et al., 1999
Chassagne, D.; Boulanger, R.; Crouzet, J., Enzymatic hydrolysis of edible Passiflora fruit glycosides, Food Chem., 1999, 66, 3, 281-288, https://doi.org/10.1016/S0308-8146(99)00044-8 . [all data]