Zinc, bis(dimethylcarbamodithioato-S,S')-, (T-4)-

Kovats' RI, non-polar column, isothermal

View large format table.

Column type Active phase Temperature (C) I Reference Comment
PackedSE-30242.2548.Krupcik, Leclercq, et al., 1979Gas-Chrom Q; Column length: 2. m

Normal alkane RI, non-polar column, temperature ramp

View large format table.

Column type Active phase I Reference Comment
PackedOV-12495.Marozzi, Gambaro, et al., 1982Gas Chrom P, 5. K/min; Column length: 2. m; Tstart: 150. C; Tend: 300. C
PackedSE-302515.Marozzi, Gambaro, et al., 1982Gas Chrom P, 5. K/min; Column length: 2. m; Tstart: 150. C; Tend: 300. C

References

Krupcik, Leclercq, et al., 1979
Krupcik, J.; Leclercq, P.A.; Garaj, J.; Masaryk, J., Analysis of Divalent Metal Dialkyldithiocarbamates by Gas Chromatography and Mass Spectrometry, J. Chromatogr., 1979, 171, 285-304, https://doi.org/10.1016/S0021-9673(01)95308-7 . [all data]

Marozzi, Gambaro, et al., 1982
Marozzi, E.; Gambaro, V.; Saligari, E.; Mariani, R.; Lodi, F., Use of the retention index in gas chromatographic studies of drugs, J. Anal. Toxicol., 1982, 6, 4, 185-192, https://doi.org/10.1093/jat/6.4.185 . [all data]