1,1,1-d3-Dimethyl ether

Gas phase ion energetics data

Data compiled by: Henry M. Rosenstock, Keith Draxl, Bruce W. Steiner, and John T. Herron

Ionization energy determinations

IE (eV) Method Reference
10.0 ± 0.1EIIvko, 1970

Appearance energy determinations

Ion AE (eV) Other Products MethodReferenceComment
CDO+13.9 ± 0.2?EIIvko, 1970
CHO+14.0 ± 0.2?EIIvko, 1970
C2H2D3O+11.2 ± 0.1HEIIvko, 1970
C2H3D2O+11.5 ± 0.1DEIIvko, 1970

References

Ivko, 1970
Ivko, A.A., Use of mass spectroscopy and isotope labelling for determining the structure of ions and molecules, Org. Katal., 1970, 20. [all data]