Borazine,2,4,6-trifluoro-1,3,5-trimethyl-

Gas phase ion energetics data

Data compiled by: Sharon G. Lias, Rhoda D. Levin, and Sherif A. Kafafi

Ionization energy determinations

IE (eV) Method Reference Comment
9.48PEBrundle and Jones, 1973Vertical value

References

Brundle and Jones, 1973
Brundle, C.R.; Jones, G.R., The high resolution photoelectron spectra and the electronic structure of XeOF4, J. Electron Spectrosc. Relat. Phenom., 1973, 1, 403. [all data]