NSS

Vibrational and/or electronic energy levels

Data compiled by: Marilyn E. Jacox

State:   X

Vib.
sym.
 No.   Approximate
 type of mode
 cm-1   Med.   Method   References

a' 1 NS stretch 1017.1 Ar IR Hassanzadeh and Andrews, 1992
3 SS stretch 594.6 Ar IR Hassanzadeh and Andrews, 1992

Additional references: Jacox, 1994, page 94

References

Hassanzadeh and Andrews, 1992
Hassanzadeh, P.; Andrews, L., Infrared spectra of new sulfur-nitrogen species in solid argon, J. Am. Chem. Soc., 1992, 114, 1, 83, https://doi.org/10.1021/ja00027a012 . [all data]

Jacox, 1994
Jacox, M.E., Vibrational and electronic energy levels of polyatomic transient molecules, American Chemical Society, Washington, DC, 1994, 464. [all data]