terbium trifluoride

Gas phase ion energetics data

Data compiled by: Henry M. Rosenstock, Keith Draxl, Bruce W. Steiner, and John T. Herron

Appearance energy determinations

Ion AE (eV) Other Products MethodReferenceComment
TbF+19.5 ± 0.7?EIZmbov and Margrave, 1968
TbF2+13.0 ± 0.7FEIZmbov and Margrave, 1968
Tb+27.0 ± 0.7?EIZmbov and Margrave, 1968

References

Zmbov and Margrave, 1968
Zmbov, K.F.; Margrave, J.L., Mass spectrometric studies of scandium, yttrium, lanthanum, and rare-earth fluorides, Advan. Chem. Ser., 1968, 72, 267. [all data]