5-Thiazoleethanol, 4-methyl-

Normal alkane RI, polar column, temperature ramp

Data compiled by: NIST Mass Spectrometry Data Center, William E. Wallace, director

Column type CapillaryCapillary
Active phase HP-InnowaxDB-Wax
Column length (m) 60.60.
Carrier gas HeHe
Substrate
Column diameter (mm) 0.320.32
Phase thickness (μm) 0.50.25
Tstart (C) 60.60.
Tend (C) 220.220.
Heat rate (K/min) 2.3.
Initial hold (min)
Final hold (min) 10.
I 2302.2309.
ReferenceSenger-Emonnot, Rochard, et al., 2006Guntert, Brüning, et al., 1990
Comment MSDC-RI MSDC-RI

Normal alkane RI, non-polar column, custom temperature program

Data compiled by: NIST Mass Spectrometry Data Center, William E. Wallace, director

Column type CapillaryCapillaryCapillary
Active phase HP-1SE-30Methyl Silicone
Column length (m) 50.
Carrier gas He
Substrate
Column diameter (mm) 0.32
Phase thickness (μm) 0.52
Program 40C => 2C/min => 130C => 4C/min => 250C (25min)not specifiednot specified
I 1247.1283.1246.
ReferenceSenger-Emonnot, Rochard, et al., 2006Vinogradov, 2004Misharina, 1995
Comment MSDC-RI MSDC-RI MSDC-RI

Phase change data

Data compiled by: Robert L. Brown and Stephen E. Stein

Reduced pressure boiling point

Tboil (K) Pressure (atm) Reference
408.20.009Weast and Grasselli, 1989

References

Senger-Emonnot, Rochard, et al., 2006
Senger-Emonnot, P.; Rochard, S.; Pellegrin, F.; George, G.; Fernandez, X.; Lizzani-Cuvelier, L., Odour active aroma compounds of sea fig (Microcosmus sulcatus), Food Chem., 2006, 97, 3, 465-471, https://doi.org/10.1016/j.foodchem.2005.05.026 . [all data]

Guntert, Brüning, et al., 1990
Guntert, M.; Brüning, J.; Emberger, R.; Köpsel, Ml; Kuhn, W.; Thielmann, T.; Werkhoff, P., Identification and formation of some selected sulfur-containing flavor compounds in various meat model systems, J. Agric. Food Chem., 1990, 38, 11, 2027-2041, https://doi.org/10.1021/jf00101a007 . [all data]