3-(Methylthio)hexyl hexanoate

Normal alkane RI, polar column, temperature ramp

View large format table.

Column type Active phase I Reference Comment
CapillaryDB-Wax2115.Werkhoff, Güntert, et al., 199860. m/0.32 mm/0.25 μm, H2, 3. K/min; Tstart: 60. C; Tend: 220. C
CapillaryDB-Wax2095.Engel and Tressl, 1991He, 2. K/min; Column length: 60. m; Column diameter: 0.32 mm; Tstart: 70. C; Tend: 230. C

References

Werkhoff, Güntert, et al., 1998
Werkhoff, P.; Güntert, M.; Krammer, G.; Sommer, H.; Kaulen, J., Vacuum headspace method in aroma research: flavor chemistry of yellow passion fruits, J. Agric. Food Chem., 1998, 46, 3, 1076-1093, https://doi.org/10.1021/jf970655s . [all data]

Engel and Tressl, 1991
Engel, K.-H.; Tressl, R., Identification of new sulfur-containing volatiles in yellow passion fruits (Passiflora edulis f. flavicarpa), J. Agric. Food Chem., 1991, 39, 12, 2249-2252, https://doi.org/10.1021/jf00012a030 . [all data]