3-Mercaptohexyl acetate

Normal alkane RI, polar column, temperature ramp

Data compiled by: NIST Mass Spectrometry Data Center, William E. Wallace, director

Column type CapillaryCapillaryCapillaryCapillaryCapillary
Active phase DB-WaxDB-WaxDB-WaxDB-WaxDB-Wax
Column length (m) 30.60.30.30.30.
Carrier gas H2HeH2HeH2
Substrate
Column diameter (mm) 0.320.250.320.320.32
Phase thickness (μm) 0.50.250.50.50.5
Tstart (C) 40.40.40.40.40.
Tend (C) 200.220.200.240.200.
Heat rate (K/min) 4.3.4.7.4.
Initial hold (min) 5.5.5. 5.
Final hold (min)    5.60.
I 1735.1741.1739.1725.1735.
ReferenceCulleré, Escudero, et al., 2004López, Ezpeleta, et al., 2004López, Ortín, et al., 2003Lin, Rouseff, et al., 2002Aznar, López, et al., 2001
Comment MSDC-RI MSDC-RI MSDC-RI MSDC-RI MSDC-RI
Column type CapillaryCapillaryCapillary
Active phase DB-WaxDB-WaxDB-Wax
Column length (m) 30.30.60.
Carrier gas H2H2H2
Substrate
Column diameter (mm) 0.320.320.32
Phase thickness (μm) 0.50.50.25
Tstart (C) 40.60.60.
Tend (C) 200.245.220.
Heat rate (K/min) 4.3.3.
Initial hold (min) 5.3.
Final hold (min) 60.20.
I 1735.1725.1697.
ReferenceFerreira, Aznar, et al., 2001Kotseridis and Baumes, 2000Werkhoff, Güntert, et al., 1998
Comment MSDC-RI MSDC-RI MSDC-RI

Normal alkane RI, non-polar column, temperature ramp

Data compiled by: NIST Mass Spectrometry Data Center, William E. Wallace, director

Column type Capillary
Active phase DB-5
Column length (m) 30.
Carrier gas He
Substrate
Column diameter (mm) 0.32
Phase thickness (μm) 0.25
Tstart (C) 40.
Tend (C) 290.
Heat rate (K/min) 7.
Initial hold (min)
Final hold (min)
I 1244.
ReferenceLin, Rouseff, et al., 2002
Comment MSDC-RI

Van Den Dool and Kratz RI, non-polar column, custom temperature program

View large format table.

Column type Active phase I Reference Comment
CapillaryDB-51252.Campo, Ferreira, et al., 2005Program: not specified

Van Den Dool and Kratz RI, polar column, temperature ramp

View large format table.

Column type Active phase I Reference Comment
CapillaryDB-Wax1740.Gurbuz O., Rouseff J.M., et al., 200630. m/0.32 mm/0.5 μm, He, 7. K/min, 265. C @ 5. min; Tstart: 40. C
CapillaryDB-Wax1728.Petka, Ferreira, et al., 200630. m/0.32 mm/0.5 μm, 40. C @ 3. min, 5. K/min, 200. C @ 8. min

Van Den Dool and Kratz RI, polar column, custom temperature program

View large format table.

Column type Active phase I Reference Comment
CapillaryDB-Wax1732.Campo, Ferreira, et al., 200530. m/0.32 mm/0.5 μm, H2; Program: 40C(5min) => 4C/min => 100C => 6C/min => 200C

Normal alkane RI, non-polar column, custom temperature program

View large format table.

Column type Active phase I Reference Comment
CapillaryCP Sil 5 CB1227.Vermeulen and Collin, 200350. m/0.32 mm/1.2 μm, He; Program: 40C(4min) => 2C/min => 132C => 10C/min => 250C(45min)

Normal alkane RI, polar column, custom temperature program

View large format table.

Column type Active phase I Reference Comment
CapillaryFFAP1727.Vermeulen and Collin, 200325. m/0.32 mm/0.3 μm; Program: 40C(4min) => 2C/min => 132C => 10C/min => 250C (15min)

References

Culleré, Escudero, et al., 2004
Culleré, L.; Escudero, A.; Cacho, J.; Ferreira, V., Gas chromatography-olfactometry and chemical quantitative study of the aroma of six premium auality Spanish aged red wines, J. Agric. Food Chem., 2004, 52, 6, 1653-1660, https://doi.org/10.1021/jf0350820 . [all data]

López, Ezpeleta, et al., 2004
López, R.; Ezpeleta, E.; Sánchez, I.; Cacho, J.; Ferreira, V., Analysis of the aroma intensities of volatile compounds released from mild acid hydrolysates of odourless precursors extracted from Tempranillo and Grenache grapes using gas chromatography-olfactometry, Food Chem., 2004, 88, 1, 95-103, https://doi.org/10.1016/j.foodchem.2004.01.025 . [all data]

López, Ortín, et al., 2003
López, R.; Ortín, N.; Pérez-Trujillo, J.P.; Cacho, J.; Ferreira, V., Impact odorants of different young white wines from the Canary islands, J. Agric. Food Chem., 2003, 51, 11, 3419-3425, https://doi.org/10.1021/jf026045w . [all data]

Lin, Rouseff, et al., 2002
Lin, J.; Rouseff, R.L.; Barros, S.; Naim, M., Aroma composition changes in early season grapefruit juice produced from thermal concentration, J. Agric. Food Chem., 2002, 50, 4, 813-819, https://doi.org/10.1021/jf011154g . [all data]

Aznar, López, et al., 2001
Aznar, M.; López, R.; Cacho, J.F.; Ferreira, V., Identification and quantification of impact odorants of aged red wines from Rioja. GC-olfactometry, quantitative GC-MS, and odor evaluation of HPLC fractions, J. Agric. Food Chem., 2001, 49, 6, 2924-2929, https://doi.org/10.1021/jf001372u . [all data]

Ferreira, Aznar, et al., 2001
Ferreira, V.; Aznar, M.; López, R.; Cacho, J., Quantitative gas chromatography-olfactometry carried out at different dilutions of an extract. Differences in the odor profiles of four high-quality spanish aged red wines, J. Agric. Food Chem., 2001, 49, 10, 4818-4824, https://doi.org/10.1021/jf010283u . [all data]

Kotseridis and Baumes, 2000
Kotseridis, Y.; Baumes, R., Identification of impact odorants in Bordeaux red grape juice, in the commercial yeast used for its fermentation, and in the produced wine, J. Agric. Food Chem., 2000, 48, 2, 400-406, https://doi.org/10.1021/jf990565i . [all data]

Werkhoff, Güntert, et al., 1998
Werkhoff, P.; Güntert, M.; Krammer, G.; Sommer, H.; Kaulen, J., Vacuum headspace method in aroma research: flavor chemistry of yellow passion fruits, J. Agric. Food Chem., 1998, 46, 3, 1076-1093, https://doi.org/10.1021/jf970655s . [all data]