Xenon hexafluoride

Phase change data

Data compiled by: Thermodynamics Research Center, NIST Boulder Laboratories, Chris Muzny director

Quantity Value Units Method Reference Comment
Tfus322.4KN/AOgrin, Jesih, et al., 1987Uncertainty assigned by TRC = 0.5 K
Quantity Value Units Method Reference Comment
Tc502.KN/AOgrin, Jesih, et al., 1987Uncertainty assigned by TRC = 0.7 K
Quantity Value Units Method Reference Comment
Pc47.00barN/AOgrin, Jesih, et al., 1987estimated by method of Hakuta and Hirata
Quantity Value Units Method Reference Comment
Vc0.2144l/molN/AOgrin, Jesih, et al., 1987Uncertainty assigned by TRC = 0.008 l/mol; estimated by method of Hakuta and Hirata

In addition to the Thermodynamics Research Center (TRC) data available from this site, much more physical and chemical property data is available from the following TRC products:

Gas phase ion energetics data

Data compiled as indicated in comments:
LLK - Sharon G. Lias, Rhoda D. Levin, and Sherif A. Kafafi

Ionization energy determinations

IE (eV) Method Reference Comment
≥11.96PEBrundle, Jones, et al., 1971LLK
12.19 ± 0.02PIBerkowitz, Chupka, et al., 1971LLK
12.35SNielsen and Schwarz, 1976Vertical value; LLK

Appearance energy determinations

Ion AE (eV) Other Products MethodReferenceComment
XeF3+15.93FPIBerkowitz, Chupka, et al., 1971LLK
XeF4+15.67 ± 0.052FPIBerkowitz, Chupka, et al., 1971LLK
XeF5+12.56FPIBerkowitz, Chupka, et al., 1971LLK

References

Ogrin, Jesih, et al., 1987
Ogrin, T.; Jesih, A.; Zemva, B., Critical Constatants of Xenon Hexafluoride, J. Chem. Eng. Data, 1987, 32, 401. [all data]