Silane,5-trichloro-2,4-cyclopentadien-1-yl-

Gas phase ion energetics data

Data compiled by: Sharon G. Lias, Rhoda D. Levin, and Sherif A. Kafafi

Ionization energy determinations

IE (eV) Method Reference Comment
9.0PECradock, Ebsworth, et al., 1975Vertical value

References

Cradock, Ebsworth, et al., 1975
Cradock, S.; Ebsworth, E.A.V.; Moretto, H.; Rankin, D.W.H., Photoelectron spectra and fluxional behaviour in some σ-cyclopentadienes, J. Chem. Soc. Dalton Trans., 1975, 390. [all data]