C6S4O2

Vibrational and/or electronic energy levels

Data compiled by: Marilyn E. Jacox

State:   X

Vib.
sym.
 No.   Approximate
 type of mode
 cm-1   Med.   Method   References

C=O stretch 1678.8 s Ar IR Maier, Schrot, et al., 1992
1512.9 s Ar IR Maier, Schrot, et al., 1992
1295.5 w Ar IR Maier, Schrot, et al., 1992
1276.2 w Ar IR Maier, Schrot, et al., 1992
1252.1 w Ar IR Maier, Schrot, et al., 1992
1239.6 w Ar IR Maier, Schrot, et al., 1992
1174.0 m Ar IR Maier, Schrot, et al., 1992
752.1 s Ar IR Maier, Schrot, et al., 1992
707.3 w Ar IR Maier, Schrot, et al., 1992

Additional references: Jacox, 1994, page 426

References

Maier, Schrot, et al., 1992
Maier, G.; Schrot, J.; Reisenauer, H.P.; Frenking, G.; Jonas, V., Cyclische C6S6-Isomere --- Matrixspektroskopische und theoretische Untersuchungen, Chem. Ber., 1992, 125, 1, 265, https://doi.org/10.1002/cber.19921250142 . [all data]

Jacox, 1994
Jacox, M.E., Vibrational and electronic energy levels of polyatomic transient molecules, American Chemical Society, Washington, DC, 1994, 464. [all data]