Bi4-

Vibrational and/or electronic energy levels

Data compiled by: Marilyn E. Jacox

State:   ?

 Energy
 (cm-1
 Med.   Transition   λmin
 (nm)
 λmax
 (nm)

References

Td = 8470 ± 800 U gas Polak, Ho, et al., 1991
Polak, Gerber, et al., 1992

Additional references: Jacox, 1994, page 197

Polak, Ho, et al., 1991
Polak, M.L.; Ho, J.; Gerber, G.; Lineberger, W.C., Photoelectron Spectroscopy of Negatively Charged Bismuth Clusters: Bi2-, Bi3-, and Bi4-, J. Chem. Phys., 1991, 95, 5, 3053, https://doi.org/10.1063/1.460862 . [all data]

Polak, Gerber, et al., 1992
Polak, M.L.; Gerber, G.; Ho, J.; Lineberger, W.C., Photoelectron Spectroscopy of Small Antimony Cluster Anions - Sb(-) Sb2(-), Sb3(-), and Sb4(-), J. Chem. Phys., 1992, 97, 12, 8990, https://doi.org/10.1063/1.463326 . [all data]

Jacox, 1994
Jacox, M.E., Vibrational and electronic energy levels of polyatomic transient molecules, American Chemical Society, Washington, DC, 1994, 464. [all data]