2-methyl-2-vinyl-5-isopropyltetrahydrofuran

Normal alkane RI, polar column, temperature ramp

View large format table.

Column type Active phase I Reference Comment
CapillaryCarbowax 20M1074.Yamaguchi and Shibamoto, 1980N2, 1. K/min; Column length: 50. m; Column diameter: 0.28 mm; Tstart: 80. C; Tend: 170. C

References

Yamaguchi and Shibamoto, 1980
Yamaguchi, K.; Shibamoto, T., Volatile constituents of the chestnut flower, J. Agric. Food Chem., 1980, 28, 1, 82-84, https://doi.org/10.1021/jf60227a021 . [all data]