3(2H)-Thiophenone, dihydro-2-methyl-

Van Den Dool and Kratz RI, non-polar column, temperature ramp

Data compiled by: NIST Mass Spectrometry Data Center, William E. Wallace, director

Column type CapillaryCapillaryCapillaryCapillaryCapillary
Active phase DB-5CP Sil 8 CBDB-5BPX-5CP Sil 8 CB
Column length (m) 60.50.60.50.60.
Carrier gas   He He
Substrate
Column diameter (mm) 0.320.320.250.320.25
Phase thickness (μm) 1. 0.250.50.25
Tstart (C) 40.60.40.60.40.
Tend (C) 260.220.275.250.280.
Heat rate (K/min) 4.4.7.4.4.
Initial hold (min) 2.5. 5.2.
Final hold (min) 10.30. 20.
I 994.979.998.1012.999.
ReferenceMethven L., Tsoukka M., et al., 2007Mahadevan and Farmer, 2006Dreher, Rouseff, et al., 2003Bredie, Mottram, et al., 2002Elmore, Campo, et al., 2002
Comment MSDC-RI MSDC-RI MSDC-RI MSDC-RI MSDC-RI
Column type CapillaryCapillaryCapillaryCapillaryCapillary
Active phase BPX-5DB-5MSBP-5BP-5DB-5
Column length (m) 50.60.50.50.30.
Carrier gas HeHe He
Substrate
Column diameter (mm) 0.320.250.320.320.32
Phase thickness (μm) 0.50.25  1.
Tstart (C) 60.40.60.60.60.
Tend (C) 250.200.250.250.250.
Heat rate (K/min) 4.3.4.4.4.
Initial hold (min) 5.5. 5.5.
Final hold (min) 10.60.  20.
I 996.990.990.990.990.
ReferenceAmes, Guy, et al., 2001Baek, Kim, et al., 2001Whitfield and Mottram, 2001Whitfield and Mottram, 1999Madruga and Mottram, 1998
Comment MSDC-RI MSDC-RI MSDC-RI MSDC-RI MSDC-RI
Column type CapillaryCapillaryCapillaryCapillary
Active phase SE-30OV-101DB-1DB-1
Column length (m) 50.50.60.60.
Carrier gas HeHeHeHe
Substrate
Column diameter (mm) 0.320.310.250.25
Phase thickness (μm) 0.250.50.250.25
Tstart (C) 50.50.40.40.
Tend (C) 250.250.220.220.
Heat rate (K/min) 8.4.2.2.
Initial hold (min)
Final hold (min)   10.10.
I 947.952.951.956.
ReferenceMisharina, Golovnya, et al., 1994Misharina, Golovnya, et al., 1992Zhang and Ho, 1991Zhang and Ho, 1991, 2
Comment MSDC-RI MSDC-RI MSDC-RI MSDC-RI

References

Methven L., Tsoukka M., et al., 2007
Methven L.; Tsoukka M.; Oruna-Concha M.J.; Parker J.K.; Mottram D.S., Influence of sulfur amino acids on the volatile and nonvolatile components of cooked salmon (Salmo salar), J. Agric. Food Chem., 2007, 55, 4, 1427-1436, https://doi.org/10.1021/jf0625611 . [all data]

Mahadevan and Farmer, 2006
Mahadevan, K.; Farmer, L., Key Odor Impact Compounds in Three Yeast Extract Pastes, J. Agric. Food Chem., 2006, 54, 19, 7242-7250, https://doi.org/10.1021/jf061102x . [all data]

Dreher, Rouseff, et al., 2003
Dreher, J.G.; Rouseff, R.L.; Naim, M., GC-olfactometric characterization of aroma volatiles from the thermal degradation of thiamin in model orange juice, J. Agric. Food Chem., 2003, 51, 10, 3097-3102, https://doi.org/10.1021/jf034023j . [all data]

Bredie, Mottram, et al., 2002
Bredie, W.L.P.; Mottram, D.S.; Guy, R.C.E., Effect of temperature and pH on the generation of flavor volatiles in extrusion cooking of wheat flour, J. Agric. Food Chem., 2002, 50, 5, 1118-1125, https://doi.org/10.1021/jf0111662 . [all data]

Elmore, Campo, et al., 2002
Elmore, J.S.; Campo, M.M.; Enser, M.; Mottram, D.S., Effect of lipid composition on meat-like model systems containing cysteine, ribose, and polyunsaturated fatty acids, J. Agric. Food Chem., 2002, 50, 5, 1126-1132, https://doi.org/10.1021/jf0108718 . [all data]

Ames, Guy, et al., 2001
Ames, J.M.; Guy, R.C.E.; Kipping, G.J., Effect of pH and temperature on the formation of volatile compounds in cysteine/reducing sugar/starch mixtures during extrusion cooking, J. Agric. Food Chem., 2001, 49, 4, 1885-1894, https://doi.org/10.1021/jf0012547 . [all data]

Baek, Kim, et al., 2001
Baek, H.H.; Kim, C.J.; Ahn, B.H.; Nam, H.S.; Cadwallader, K.R., Aroma extract dilution analysis of a beeflike process flavor from extruded enzyme-hydrolyzed soybean protein, J. Agric. Food Chem., 2001, 49, 2, 790-793, https://doi.org/10.1021/jf000609j . [all data]

Whitfield and Mottram, 2001
Whitfield, F.B.; Mottram, D.S., Heterocyclic volatiles formed by heating cysteine or hydrogen sulfide with 4-hydroxy-5-methyl-3(2H)-furanone at pH 6.5, J. Agric. Food Chem., 2001, 49, 2, 816-822, https://doi.org/10.1021/jf0008644 . [all data]

Whitfield and Mottram, 1999
Whitfield, F.B.; Mottram, D.S., Investigation of the reaction between 4-hydroxy-5-methyl-3(2H)-furanone and cysteine or hydrogen sulfide at pH 4.5, J. Agric. Food Chem., 1999, 47, 4, 1626-1634, https://doi.org/10.1021/jf980980v . [all data]

Madruga and Mottram, 1998
Madruga, M.S.; Mottram, D.S., The effect of pH on the formation of volatile compounds produced by heating a model system containing 5'-imp and cysteine, J. Braz. Chem. Soc., 1998, 9, 3, 261-271, https://doi.org/10.1590/S0103-50531998000300010 . [all data]

Misharina, Golovnya, et al., 1994
Misharina, T.A.; Golovnya, R.V.; Strashnenko, E.S.; Medvedeva, I.B., Sorbtion-structural mass-spectrometric characteristics of volatile components of model systems and flavor compounds with meat odor, Zh. Anal. Khim., 1994, 49, 7, 722-728. [all data]

Misharina, Golovnya, et al., 1992
Misharina, T.A.; Golovnya, R.V.; Artamonova, M.P.; Zhuravskaya, N.K., Identification of volatile components of a model system with meat aroma, Zh. Anal. Khim., 1992, 47, 850-857. [all data]

Zhang and Ho, 1991
Zhang, Y.; Ho, C.-T., Formation of meatlike aroma compounds from thermal reaction of inosine 5'-monophosphate with cysteine and glutathione, J. Agric. Food Chem., 1991, 39, 6, 1145-1148, https://doi.org/10.1021/jf00006a031 . [all data]

Zhang and Ho, 1991, 2
Zhang, Y.; Ho, C.-T., Comparison of the volatile compounds formed from the thermal reaction of glucose with cysteine and glutathione, J. Agric. Food Chem., 1991, 39, 4, 760-763, https://doi.org/10.1021/jf00004a029 . [all data]