1-(2-Thienyl)-1-propanone

Normal alkane RI, non-polar column, custom temperature program

Data compiled by: NIST Mass Spectrometry Data Center, William E. Wallace, director

Column type CapillaryCapillary
Active phase Polydimethyl siloxaneSE-30
Column length (m)
Carrier gas
Substrate
Column diameter (mm)
Phase thickness (μm)
Program 40 0C 20 0C/min -> 60 0C (5 min) 4 0C/min -> 250 0Cnot specified
I 1189.1164.
ReferenceXu, He, et al., 2010Vinogradov, 2004
Comment MSDC-RI MSDC-RI

Van Den Dool and Kratz RI, non-polar column, custom temperature program

Data compiled by: NIST Mass Spectrometry Data Center, William E. Wallace, director

Column type Capillary
Active phase DB-5
Column length (m) 50.
Carrier gas He
Substrate
Column diameter (mm) 0.32
Phase thickness (μm)
Program 0C => 60C/min => 60C (5min) => 4C/min => 250C
I 1188.
ReferenceMottram and Whitfield, 1995
Comment MSDC-RI

Van Den Dool and Kratz RI, non-polar column, temperature ramp

Data compiled by: NIST Mass Spectrometry Data Center, William E. Wallace, director

Column type CapillaryCapillaryCapillaryCapillary
Active phase DB-5OV-101OV-101DB-1
Column length (m) 30.50.50.60.
Carrier gas  HeHeHe
Substrate
Column diameter (mm) 0.320.320.310.25
Phase thickness (μm) 1.0.50.50.25
Tstart (C) 60.50.50.40.
Tend (C) 250.200.250.220.
Heat rate (K/min) 4.4.4.2.
Initial hold (min) 5.
Final hold (min) 20.  10.
I 1181.1164.1166.1153.
ReferenceMadruga and Mottram, 1998Misharina, Golovnya, et al., 1993Misharina, Golovnya, et al., 1992Zhang and Ho, 1991
Comment MSDC-RI MSDC-RI MSDC-RI MSDC-RI

References

Xu, He, et al., 2010
Xu, H.; He, W.; Liu, X.; Gao, Y., Effect of pressure on the Maillard reaction between ribose and cysteine in supercritical carbon dioxide, Czech J. Food Sci., 2010, 28, 3, 192-201. [all data]

Vinogradov, 2004
Vinogradov, B.A., Production, composition, properties and application of essential oils, 2004, retrieved from http://viness.narod.ru. [all data]