2-Furancarbothioic acid, S-methyl ester

Normal alkane RI, polar column, temperature ramp

Data compiled by: NIST Mass Spectrometry Data Center, William E. Wallace, director

Column type CapillaryCapillaryCapillaryCapillary
Active phase Carbowax 20MCarbowax 20MCarbowax 20MCarbowax 20M
Column length (m) 100.100.100.100.
Carrier gas   N2N2
Substrate
Column diameter (mm) 0.250.250.250.25
Phase thickness (μm)
Tstart (C) 70.70.70.70.
Tend (C) 170.170.170.170.
Heat rate (K/min) 1.1.1.1.
Initial hold (min)
Final hold (min)
I 1549.1552.1548.1549.
ReferenceShibamoto and Russell, 1977Shibamoto and Russell, 1977Shibamoto and Russell, 1976Shibamoto and Russell, 1976
Comment MSDC-RI MSDC-RI MSDC-RI MSDC-RI

References

Shibamoto and Russell, 1977
Shibamoto, T.; Russell, G.F., A study of the volatiles isolated from a D-glucose-hydrogen sulfide-ammonia model system, J. Agric. Food Chem., 1977, 25, 1, 109-112, https://doi.org/10.1021/jf60209a054 . [all data]

Shibamoto and Russell, 1976
Shibamoto, T.; Russell, G.F., Study of meat volatiles associated with aroma generated in a D-glucose-hydrogen sulfide-ammonia model system, J. Agric. Food Chem., 1976, 24, 4, 843-846, https://doi.org/10.1021/jf60206a047 . [all data]