2-Propanol, 1-chloro-, phosphate (3:1)

Van Den Dool and Kratz RI, non-polar column, custom temperature program

View large format table.

Column type Active phase I Reference Comment
CapillaryHP-5MS1814.Hankemeier, Rozenbrand, et al., 1998Program: not specified
CapillaryHP-5MS1814.Hankemeier, Rozenbrand, et al., 1998Program: not specified
CapillaryHP-5MS1818.Hankemeier, Rozenbrand, et al., 1998Program: not specified
CapillaryHP-5MS1820.Hankemeier, Rozenbrand, et al., 1998Program: not specified

References

Hankemeier, Rozenbrand, et al., 1998
Hankemeier, Th.; Rozenbrand, J.; Abhadur, M.; Vreuls, J.J.; Brinkman, U.A.Th., Data Correlation in On-Line Solid-Phase Extraction - Gas Chromatography - Atomic Emission / Mass Spectrometric Detection of Unknown Microcontaminants, Chromatographia, 1998, 48, 3/4, 273-283, https://doi.org/10.1007/BF02467683 . [all data]