Benzenepropanoic acid, α-hydroxy-, methyl ester

Normal alkane RI, non-polar column, custom temperature program

Data compiled by: NIST Mass Spectrometry Data Center, William E. Wallace, director

Column type Capillary
Active phase HP-1
Column length (m) 25.
Carrier gas
Substrate
Column diameter (mm) 0.25
Phase thickness (μm) 0.25
Program 30 0C (4 min) 6 K/min -> 200 0C 15 K/min -> 250 0C (20 min)
I 1320.
ReferenceRowland, Blackman, et al., 1995
Comment MSDC-RI

References

Rowland, Blackman, et al., 1995
Rowland, C.Y.; Blackman, A.J.; D'Arcy, B.R.; Rintoul, G.B., Comparison of organic extractives found in leatherwood (Eucryphia lucida) honey and leatherwood flowers and leaves, J. Agric. Food Chem., 1995, 43, 3, 753-763, https://doi.org/10.1021/jf00051a036 . [all data]