ArBeO

Vibrational and/or electronic energy levels

Data compiled by: Marilyn E. Jacox

State:   X

Vib.
sym.
 No.   Approximate
 type of mode
 cm-1   Med.   Method   References

BeO stretch 1526.1 Ar IR Thompson and Andrews, 1994

Additional references: Jacox, 1998, page 188

References

Thompson and Andrews, 1994
Thompson, C.A.; Andrews, L., Noble Gas Complexes with BeO: Infrared Spectra of NG-BeO (NG = Ar, Kr, Xe), J. Am. Chem. Soc., 1994, 116, 1, 423, https://doi.org/10.1021/ja00080a069 . [all data]

Jacox, 1998
Jacox, M.E., Vibrational and electronic energy levels of polyatomic transient molecules: supplement A, J. Phys. Chem. Ref. Data, 1998, 27, 2, 115-393, https://doi.org/10.1063/1.556017 . [all data]