Bicyclo[3.2.0]heptane, 3,3-dimethyl-

Reaction thermochemistry data

Data compiled by: Hussein Y. Afeefy, Joel F. Liebman, and Stephen E. Stein

Individual Reactions

3,3-Dimethylbicylo[3.2.0]hepta-1,4-diene + 2Hydrogen = Bicyclo[3.2.0]heptane, 3,3-dimethyl-

By formula: C9H12 + 2H2 = C9H16

Quantity Value Units Method Reference Comment
Δr-291. ± 2.kJ/molChydRoth, Adamczak, et al., 1991liquid phase

References

Roth, Adamczak, et al., 1991
Roth, W.R.; Adamczak, O.; Breuckmann, R.; Lennartz, H.-W.; Boese, R., Die Berechnung von Resonanzenergien; das MM2ERW-Kraftfeld, Chem. Ber., 1991, 124, 2499-2521. [all data]