Ethyl 3-(methylthio)-(E)-2-propenoate

Normal alkane RI, non-polar column, temperature ramp

Data compiled by: NIST Mass Spectrometry Data Center, William E. Wallace, director

Column type Capillary
Active phase DB-1
Column length (m) 60.
Carrier gas He
Substrate
Column diameter (mm) 0.32
Phase thickness (μm)
Tstart (C) 50.
Tend (C) 220.
Heat rate (K/min) 4.
Initial hold (min) 5.
Final hold (min)
I 1144.
ReferenceTakeoka, Buttery, et al., 1991
Comment MSDC-RI

References

Takeoka, Buttery, et al., 1991
Takeoka, G.R.; Buttery, R.G.; Teranishi, R.; Flath, R.A.; Güntert, M., Identification of additional pineapple volatiles, J. Agric. Food Chem., 1991, 39, 10, 1848-1851, https://doi.org/10.1021/jf00010a032 . [all data]