As3Ga3

Gas phase ion energetics data

Data compiled by: John E. Bartmess

Electron affinity determinations

EA (eV) Method Reference Comment
2.10 ± 0.10LPESJin, Taylor, et al., 1990EA=Vertical Detachment Energy. Poor mass resolution means ion=mixture of Ga(x)As(y), x+y=6
<1.81999LPDLiu, Zhang, et al., 1986EA for Ge(x)As(y)- reported, x+y=5 to 30, x and y unknown but approx. equal.

References

Jin, Taylor, et al., 1990
Jin, C.; Taylor, K.J.; Conceicao, J.; Smalley, R.E., Ultraviolet Photoelectron Spectra of Gallium Arsenide Clusters., Chem. Phys. Lett., 1990, 175, 1-2, 17, https://doi.org/10.1016/0009-2614(90)85511-A . [all data]

Liu, Zhang, et al., 1986
Liu, Y.; Zhang, Q.-L.; Tittel, F.K.; Curl, R.F.; Smalley, R.E., Photodetachment and Photofragmentation Studies of Semiconductor Cluster Anions, J. Chem. Phys., 1986, 85, 12, 7434, https://doi.org/10.1063/1.451332 . [all data]