1-Phenanthrenecarboxaldehyde, 1,2,3,4,4a,9,10,10a-octahydro-1,4a-dimethyl-7-(1-methylethyl)-, [1R-(1α,4aβ,10aα)]-

Normal alkane RI, non-polar column, temperature ramp

Data compiled by: NIST Mass Spectrometry Data Center, William E. Wallace, director

Column type CapillaryCapillaryCapillaryCapillaryCapillary
Active phase SPB-1HP-5HP-5HP-1HP-1
Column length (m) 30.30.30.30.30.
Carrier gas HeliumHeliumHeliumHeHe
Substrate
Column diameter (mm) 0.250.250.250.250.25
Phase thickness (μm) 0.250.250.250.10.1
Tstart (C) 50.50.50.50.50.
Tend (C) 250.300.300.300.300.
Heat rate (K/min) 5.3.3.5.5.
Initial hold (min) 3.  2.2.
Final hold (min) 15.30.30.3.3.
I 2270.2259.2260.2265.2265.
ReferenceLazarevic, Palic, et al., 2010Isidorov, Lech, et al., 2008Isidorov, Lech, et al., 2008Boatright and Crum, 1997Boatright and Crum, 1997
Comment MSDC-RI MSDC-RI MSDC-RI MSDC-RI MSDC-RI

Normal alkane RI, non-polar column, custom temperature program

Data compiled by: NIST Mass Spectrometry Data Center, William E. Wallace, director

Column type CapillaryCapillaryCapillary
Active phase HP-5HP-5HP-5
Column length (m) 30.30.30.
Carrier gas HeliumHeliumHelium
Substrate
Column diameter (mm) 0.250.250.25
Phase thickness (μm) 0.250.250.25
Program not specifiednot specified130 0C 5 0C/min -> 240 0C 15 0C/min -> 320 0C (10 min)
I 2263.2263.2275.
ReferenceIsidorov, Lech, et al., 2008Isidorov, Lech, et al., 2008Vichi, Aumatell, et al., 2008
Comment MSDC-RI MSDC-RI MSDC-RI

Van Den Dool and Kratz RI, non-polar column, temperature ramp

Data compiled by: NIST Mass Spectrometry Data Center, William E. Wallace, director

Column type CapillaryCapillaryCapillary
Active phase HP-5MSHP-5MSHP-5
Column length (m) 30.30.30.
Carrier gas  HeHe
Substrate
Column diameter (mm) 0.250.250.25
Phase thickness (μm) 0.250.250.25
Tstart (C) 50.60.50.
Tend (C) 280.280.280.
Heat rate (K/min) 3.4.4.
Initial hold (min) 5.5.5.
Final hold (min)
I 2263.2268.2263.
ReferenceDemetzos, Angelopoulou, et al., 2002Skaltsa, Mavrommati, et al., 2001Lazari, Skaltsa, et al., 2000
Comment MSDC-RI MSDC-RI MSDC-RI

References

Lazarevic, Palic, et al., 2010
Lazarevic, J.S.; Palic, R.V.M.; Radulovic, N.S.; Ristic, N.R.; Stojanovic, G.S., Chemical composition and screening of the antimicrobial and antioxidative acrivity of extracts of Stachys species, J. Serb. Chem. Soc., 2010, 75, 10, 1347-1359, https://doi.org/10.2298/JSC100601117L . [all data]

Isidorov, Lech, et al., 2008
Isidorov, V.A.; Lech, P.; Zolciak, A.; Rusak, N.; Szczepaniak, L., Gas Chromatographic - nass spectrometric investigation of metabolites from the needles and roots of pine seedlings at early stages of pathogenic fungi Armillaria ostoyae attack, Trees, 2008, 22, 4, 531-542, https://doi.org/10.1007/s00468-008-0213-z . [all data]

Boatright and Crum, 1997
Boatright, W.L.; Crum, A.D., Nonpolar-volatile lipids from soy protein isolates and hexane-defatted flakes, J. Amer. Oil Chem. Soc., 1997, 74, 4, 461-467, https://doi.org/10.1007/s11746-997-0107-z . [all data]