BeF3K

Reaction thermochemistry data

Data compiled by: John E. Bartmess

Individual Reactions

AlF4- + BeF3K = (AlF4- • BeF3K)

By formula: AlF4- + BeF3K = (AlF4- • BeF3K)

Quantity Value Units Method Reference Comment
Δr192. ± 8.4kJ/molTDAsNikitin, Sorokin, et al., 1980gas phase; value altered from reference due to conversion from electron convention to ion convention

Be2F5- + BeF3K = (Be2F5- • BeF3K)

By formula: Be2F5- + BeF3K = (Be2F5- • BeF3K)

Quantity Value Units Method Reference Comment
Δr188. ± 8.4kJ/molN/ANikitin, Sorokin, et al., 1980gas phase; value altered from reference due to conversion from electron convention to ion convention

Ion clustering data

Data compiled by: John E. Bartmess

Clustering reactions

AlF4- + BeF3K = (AlF4- • BeF3K)

By formula: AlF4- + BeF3K = (AlF4- • BeF3K)

Quantity Value Units Method Reference Comment
Δr192. ± 8.4kJ/molTDAsNikitin, Sorokin, et al., 1980gas phase; value altered from reference due to conversion from electron convention to ion convention

Be2F5- + BeF3K = (Be2F5- • BeF3K)

By formula: Be2F5- + BeF3K = (Be2F5- • BeF3K)

Quantity Value Units Method Reference Comment
Δr188. ± 8.4kJ/molN/ANikitin, Sorokin, et al., 1980gas phase; value altered from reference due to conversion from electron convention to ion convention

References

Nikitin, Sorokin, et al., 1980
Nikitin, M.I.; Sorokin, I.D.; Skokan, E.V.; Sidorov, L.N., Negative Ions in the Saturated Vapors of the Potassium Fluoride - Hafnium Tetrafluoride and Potassium Fluoride - Beryllium Difluoride Systems, Russ. J. Phys. Chem., 1980, 54, page]. [all data]