H5NSi

Reaction thermochemistry data

Data compiled by: John E. Bartmess

Individual Reactions

H4NSi- + Hydrogen cation = H5NSi

By formula: H4NSi- + H+ = H5NSi

Quantity Value Units Method Reference Comment
Δr375.5 ± 3.1kcal/molG+TSKrempp and Damrauer, 1995gas phase; Acidity between EtCN, nBuOH
Quantity Value Units Method Reference Comment
Δr368.0 ± 3.0kcal/molIMRBKrempp and Damrauer, 1995gas phase; Acidity between EtCN, nBuOH

Vibrational and/or electronic energy levels

Data compiled by: Marilyn E. Jacox

State:   X

Vib.
sym.
 No.   Approximate
 type of mode
 cm-1   Med.   Method   References

NH2 a-stretch 3547 gas IR Beach, 1992
NH2 s-stretch 3445 gas IR Beach, 1992
SiH stretch 2172 gas IR Beach, 1992
NH2 scissors 1564 gas IR Beach, 1992
SiH3 deform. 996 gas IR Beach, 1992
SiH3 deform. 983 gas IR Beach, 1992
SiH3 deform. 970 gas IR Beach, 1992
SiN stretch 845 gas IR Beach, 1992
Deform. 670 T gas IR Beach, 1992

Additional references: Jacox, 1994, page 360

References

Krempp and Damrauer, 1995
Krempp, M.; Damrauer, R., The Gas-phase Chemistry of Silamide Ions, Organomet., 1995, 14, 1, 170, https://doi.org/10.1021/om00001a027 . [all data]

Beach, 1992
Beach, D.B., Infrared and mass spectroscopic study of the reaction of silyl iodide and ammonia. Infrared spectrum of silylamine, Inorg. Chem., 1992, 31, 20, 4174, https://doi.org/10.1021/ic00046a035 . [all data]

Jacox, 1994
Jacox, M.E., Vibrational and electronic energy levels of polyatomic transient molecules, American Chemical Society, Washington, DC, 1994, 464. [all data]