dicesium molybdate

Gas phase ion energetics data

Data compiled by: Sharon G. Lias, Rhoda D. Levin, and Sherif A. Kafafi

Ionization energy determinations

IE (eV) Method Reference
7.EIJohnson, 1975

Appearance energy determinations

Ion AE (eV) Other Products MethodReferenceComment
Cs2MoO3+~12.OEIJohnson, 1975

References

Johnson, 1975
Johnson, I., Mass spectrometric study of the vaporization of cesium and sodium molybdates, J. Phys. Chem., 1975, 79, 722. [all data]