Cyclo-pentakis(dichlorophosphonitrile)

Gas phase ion energetics data

Data compiled by: Henry M. Rosenstock, Keith Draxl, Bruce W. Steiner, and John T. Herron

Ionization energy determinations

IE (eV) Method Reference
9.83 ± 0.05EIBrion, Oldfield, et al., 1966

References

Brion, Oldfield, et al., 1966
Brion, C.E.; Oldfield, D.J.; Paddock, N.L., Huckel type interactions in phosphonitrilic derivatives, Chem. Commun., 1966, 226. [all data]