rhenium pentachloride

Gas phase ion energetics data

Data compiled as indicated in comments:
LLK - Sharon G. Lias, Rhoda D. Levin, and Sherif A. Kafafi

Ionization energy determinations

IE (eV) Method Reference Comment
9.2PEEgdell and Orchard, 1978LLK
9.50PEEgdell and Orchard, 1978Vertical value; LLK

References

Egdell and Orchard, 1978
Egdell, R.G.; Orchard, A.F., He(II) Photoelectron spectra of indium(I) and thallium(I) halides, J. Chem. Soc. Faraday Trans. 2, 1978, 74, 1179. [all data]