2,2,3,3,5,5,6,6-Octafluoromorpholine

Phase change data

Data compiled by: William E. Acree, Jr., James S. Chickos

Enthalpy of vaporization

ΔvapH (kcal/mol) Temperature (K) Method Reference Comment
7.82288.AStephenson and Malanowski, 1987Based on data from 273. - 323. K. See also Banks, Haszeldine, et al., 1967.

References

Stephenson and Malanowski, 1987
Stephenson, Richard M.; Malanowski, Stanislaw, Handbook of the Thermodynamics of Organic Compounds, 1987, https://doi.org/10.1007/978-94-009-3173-2 . [all data]

Banks, Haszeldine, et al., 1967
Banks, R.E.; Haszeldine, R.N.; Hatton, R., N-fluoro-compounds. Part II. Reaction of perfluoro-N-fluoropiperidine or perfluoro-N-fluoromorpholine with manganese pentacarbonyl hydride to give the corresponding N?H compounds, J. Chem. Soc., C, 1967, 427, https://doi.org/10.1039/j39670000427 . [all data]