CAS Reg. No. 135774-12-8

Reaction thermochemistry data

Data compiled by: John E. Bartmess

Individual Reactions

(CAS Reg. No. 135774-12-8 • 4294967295chromium) + chromium = CAS Reg. No. 135774-12-8

By formula: (CAS Reg. No. 135774-12-8 • 4294967295Cr) + Cr = CAS Reg. No. 135774-12-8

Quantity Value Units Method Reference Comment
Δr123. ± 6.7kJ/molN/ACasey, Villata, et al., 1991gas phase; See also Casey and Leopold, 1993 for more analysis.

References

Casey, Villata, et al., 1991
Casey, S.M.; Villata, P.W.; Bengali, A.A.; Cheng, C.-L.; Dick, J.P.; Fenn, P.T.; Leopold, D.G., A Study of Cr2 by Negative ion Photoelectron Spectroscopy, J. Am. Chem. Soc., 1991, 113, 17, 6688, https://doi.org/10.1021/ja00017a058 . [all data]

Casey and Leopold, 1993
Casey, S.M.; Leopold, D.G., Negative Ion Photoelectron Spectroscopy of Cr2, J. Phys. Chem., 1993, 97, 4, 816, https://doi.org/10.1021/j100106a005 . [all data]