Phosphine, germyl-

Gas phase ion energetics data

Data compiled by: Sharon G. Lias, Rhoda D. Levin, and Sherif A. Kafafi

Ionization energy determinations

IE (eV) Method Reference Comment
9.7 ± 0.1PECradock, Ebsworth, et al., 1972Vertical value

References

Cradock, Ebsworth, et al., 1972
Cradock, S.; Ebsworth, E.A.V.; Savage, W.J.; Whiteford, R.A., Photoelectron spectra of some methyl, silyl and germyl amines, phosphines and arsines, J. Chem. Soc. Faraday Trans. 2, 1972, 68, 934. [all data]