Germanium monohydride

Reaction thermochemistry data

Data compiled by: John E. Bartmess

Individual Reactions

Ge- + Hydrogen cation = Germanium monohydride

By formula: Ge- + H+ = GeH

Quantity Value Units Method Reference Comment
Δr1457. ± 21.kJ/molD-EAScheer, Bilodeau, et al., 1998gas phase; Given: 1.232712(15) eV
Quantity Value Units Method Reference Comment
Δr1434. ± 22.kJ/molH-TSScheer, Bilodeau, et al., 1998gas phase; Given: 1.232712(15) eV

Gas phase ion energetics data

Data compiled by: John E. Bartmess

De-protonation reactions

Ge- + Hydrogen cation = Germanium monohydride

By formula: Ge- + H+ = GeH

Quantity Value Units Method Reference Comment
Δr1457. ± 21.kJ/molD-EAScheer, Bilodeau, et al., 1998gas phase; Given: 1.232712(15) eV
Quantity Value Units Method Reference Comment
Δr1434. ± 22.kJ/molH-TSScheer, Bilodeau, et al., 1998gas phase; Given: 1.232712(15) eV

Constants of diatomic molecules

Data compiled by: Klaus P. Huber and Gerhard H. Herzberg

Data collected through September, 1976

Symbols used in the table of constants
SymbolMeaning
State electronic state and / or symmetry symbol
Te minimum electronic energy (cm-1)
ωe vibrational constant – first term (cm-1)
ωexe vibrational constant – second term (cm-1)
ωeye vibrational constant – third term (cm-1)
Be rotational constant in equilibrium position (cm-1)
αe rotational constant – first term (cm-1)
γe rotation-vibration interaction constant (cm-1)
De centrifugal distortion constant (cm-1)
βe rotational constant – first term, centrifugal force (cm-1)
re internuclear distance (Å)
Trans. observed transition(s) corresponding to electronic state
ν00 position of 0-0 band (units noted in table)
Diatomic constants for 72GeH
StateTeωeωexeωeyeBeαeγeDeβereTrans.ν00
B (2Σ) [41074] 1          B ← X R 39686 H
Barrow, Drummond, et al., 1953
           B ← X R 40573 H
Barrow, Drummond, et al., 1953
A 2Δ 25454 2 [1185.15] Z (127) 3  6.535 4 0.6196  [0.000571] 5  1.611 A ↔ X R 25197.0 Z
missing citation; missing citation; Veseth, 1973
a 4Σ(-) [16747] 6    [6.7654] 6   [0.000460]  [1.5834] a → X V 15802.8 Z
Kleman and Werhagen, 1953; Klynning, 1966
StateTeωeωexeωeyeBeαeγeDeβereTrans.ν00
X 2Πr 0 7 [1833.77] Z (37) 3  6.7259 8 0.1916  [0.000326] 9  1.5880

References

Scheer, Bilodeau, et al., 1998
Scheer, M.; Bilodeau, R.C.; Brodie, C.A.; Haugen, H.K., Systematic study of the stable states of C-, Si-, Ge-, and Sn- via infrared laser spectroscopy, Phys. Rev. A, 1998, 58, 4, 2844-2856, https://doi.org/10.1103/PhysRevA.58.2844 . [all data]

Barrow, Drummond, et al., 1953
Barrow, R.F.; Drummond, G.; Garton, W.R.S., Ultra-violet bands associated with germanium, Proc. Phys. Soc. London Sect. A, 1953, 66, 191. [all data]

Veseth, 1973
Veseth, L., Some anomalies in the electronic spectra of GeH, GeD, SnH, and SnD related to Hund's coupling case (c), J. Mol. Spectrosc., 1973, 48, 283. [all data]

Kleman and Werhagen, 1953
Kleman, B.; Werhagen, E., A 4Σ--2Π-system in germanium hydride (GeH), Ark. Fys., 1953, 6, 399. [all data]

Klynning, 1966
Klynning, L., On the 4Σ state of GeH, Ark. Fys., 1966, 32, 563. [all data]

Veseth, 1971
Veseth, L., Second-order spin-orbit splitting in 2Δ states of diatomic molecules, Physica (Amsterdam), 1971, 56, 286. [all data]

Klynning and Lindgren, 1966
Klynning, L.; Lindgren, B., Rotational analysis of the 2Δ-2Π band system of GeH and of GeD, Ark. Fys., 1966, 32, 575. [all data]

Hougen, 1962
Hougen, J.T., The rotational energy levels of diatomic molecules in 4Σ electronic states, Can. J. Phys., 1962, 40, 598. [all data]

Barrow and Deutsch, 1960
Barrow, R.F.; Deutsch, J.L., Gaseous SiH and GeH, Proc. Chem. Soc. London, 1960, 122. [all data]