dysprosium trifluoride

Gas phase ion energetics data

Data compiled by: Henry M. Rosenstock, Keith Draxl, Bruce W. Steiner, and John T. Herron

Appearance energy determinations

Ion AE (eV) Other Products MethodReferenceComment
Dy+27.4 ± 0.7?EIZmbov and Margrave, 1968
Dy+25.0 ± 0.3?ElBesenbruch, Charlu, et al., 1967
DyF+20.0 ± 0.7?EIZmbov and Margrave, 1968
DyF+19.5 ± 0.3?EIBesenbruch, Charlu, et al., 1967
DyF2+13.5 ± 0.7FEIZmbov and Margrave, 1968

References

Zmbov and Margrave, 1968
Zmbov, K.F.; Margrave, J.L., Mass spectrometric studies of scandium, yttrium, lanthanum, and rare-earth fluorides, Advan. Chem. Ser., 1968, 72, 267. [all data]

Besenbruch, Charlu, et al., 1967
Besenbruch, G.; Charlu, T.V.; Zmbov, K.F.; Margrave, J.L., Mass spectrometric studies at high temperatures. XVII. Sublimation and vapor pressures of Dy(III), HO(III) and Er(III) fluorides, J. Less-Common Metals, 1967, 12, 375. [all data]