Aluminum difluoride

Gas phase thermochemistry data

Quantity Value Units Method Reference Comment
Δfgas-166.00kcal/molReviewChase, 1998Data last reviewed in June, 1976
Quantity Value Units Method Reference Comment
gas,1 bar63.145cal/mol*KReviewChase, 1998Data last reviewed in June, 1976

Gas Phase Heat Capacity (Shomate Equation)

Cp° = A + B*t + C*t2 + D*t3 + E/t2
H° − H°298.15= A*t + B*t2/2 + C*t3/3 + D*t4/4 − E/t + F − H
S° = A*ln(t) + B*t + C*t2/2 + D*t3/3 − E/(2*t2) + G
    Cp = heat capacity (cal/mol*K)
    H° = standard enthalpy (kcal/mol)
    S° = standard entropy (cal/mol*K)
    t = temperature (K) / 1000.

View plot Requires a JavaScript / HTML 5 canvas capable browser.

View table.

Temperature (K) 298. - 2000.2000. - 6000.
A 11.2406015.09560
B 4.690271-0.717936
C -2.9530000.141589
D 0.630050-0.006479
E -0.129184-1.532401
F -169.9690-173.2680
G 74.7484978.22710
H -166.0000-166.0000
ReferenceChase, 1998Chase, 1998
Comment Data last reviewed in June, 1976 Data last reviewed in June, 1976

References

Chase, 1998
Chase, M.W., Jr., NIST-JANAF Themochemical Tables, Fourth Edition, J. Phys. Chem. Ref. Data, Monograph 9, 1998, 1-1951. [all data]