CF3ONO2

Vibrational and/or electronic energy levels

Data compiled by: Marilyn E. Jacox

State:   X

Vib.
sym.
 No.   Approximate
 type of mode
 cm-1   Med.   Method   References

NO2 a-stretch 1744 gas IR Chen, Young, et al., 1993
NO2 a-stretch 1735.5 Ar IR Clemitshaw and Sodeau, 1987
1345.2 Ar IR Clemitshaw and Sodeau, 1987
NO2 s-stretch 1334 gas IR Chen, Young, et al., 1993
NO2 s-stretch 1327.1 Ar IR Clemitshaw and Sodeau, 1987
CF3 stretch 1264 gas IR Chen, Young, et al., 1993
CF3 stretch 1260.8 s Ar IR Clemitshaw and Sodeau, 1987
CF3 stretch 1244 gas IR Chen, Young, et al., 1993
CF3 stretch 1249.5 vs Ar IR Clemitshaw and Sodeau, 1987
1151 gas IR Chen, Young, et al., 1993
1142.5 vs Ar IR Clemitshaw and Sodeau, 1987
C-O stretch 924 gas IR Chen, Young, et al., 1993
C-O stretch 924.1 w Ar IR Clemitshaw and Sodeau, 1987
NO2 scissors 791 gas IR Chen, Young, et al., 1993
NO2 scissors 785.2 Ar IR Clemitshaw and Sodeau, 1987
ONO2 OPLA 752.9 Ar IR Clemitshaw and Sodeau, 1987
519.0 Ar IR Clemitshaw and Sodeau, 1987

Additional references: Jacox, 1994, page 382; Jacox, 1998, page 342

References

Chen, Young, et al., 1993
Chen, J.; Young, V.; Zhu, T.; Niki, H., Long-path Fourier-transform infrared spectroscopic study of the reactions of trifluoromethylperoxy and trifluoromethoxy radicals with nitrogen dioxide, J. Phys. Chem., 1993, 97, 45, 11696, https://doi.org/10.1021/j100147a024 . [all data]

Clemitshaw and Sodeau, 1987
Clemitshaw, K.C.; Sodeau, J.R., Atmospheric chemistry at 4.2 K: a matrix isolation study of the reaction between peroxytrifluoromethane radicals and nitric oxide, J. Phys. Chem., 1987, 91, 13, 3650, https://doi.org/10.1021/j100297a037 . [all data]

Jacox, 1994
Jacox, M.E., Vibrational and electronic energy levels of polyatomic transient molecules, American Chemical Society, Washington, DC, 1994, 464. [all data]

Jacox, 1998
Jacox, M.E., Vibrational and electronic energy levels of polyatomic transient molecules: supplement A, J. Phys. Chem. Ref. Data, 1998, 27, 2, 115-393, https://doi.org/10.1063/1.556017 . [all data]