HMg2OH

Vibrational and/or electronic energy levels

Data compiled by: Marilyn E. Jacox

State:   X

Vib.
sym.
 No.   Approximate
 type of mode
 cm-1   Med.   Method   References

MgH stretch 1524.4 Ar IR Kauffman, Hauge, et al., 1984
MgO stretch 736.2 Ar IR Kauffman, Hauge, et al., 1984
MgOH bend 692 Ar IR Kauffman, Hauge, et al., 1984
MgMg stretch 544.2 Ar IR Kauffman, Hauge, et al., 1984

Additional references: Jacox, 1994, page 246

References

Kauffman, Hauge, et al., 1984
Kauffman, J.W.; Hauge, R.H.; Margrave, J.L., High Temp. Sci., 1984, 18, 97. [all data]

Jacox, 1994
Jacox, M.E., Vibrational and electronic energy levels of polyatomic transient molecules, American Chemical Society, Washington, DC, 1994, 464. [all data]