HFe2F

Vibrational and/or electronic energy levels

Data compiled by: Marilyn E. Jacox

State:   X

Vib.
sym.
 No.   Approximate
 type of mode
 cm-1   Med.   Method   References

HFe stretch 1713.9 Ar IR Kauffman, Hauge, et al., 1984
FeF stretch 651.6 Ar IR Kauffman, Hauge, et al., 1984

Additional references: Jacox, 1994, page 155

References

Kauffman, Hauge, et al., 1984
Kauffman, J.W.; Hauge, R.H.; Margrave, J.L., Reactions of Iron Atoms and Iron Dimers with Methane, Ammonia, and Hydrogen Fluoride in Low Temperature Matrices, High Temp. Sci., 1984, 17, 237. [all data]

Jacox, 1994
Jacox, M.E., Vibrational and electronic energy levels of polyatomic transient molecules, American Chemical Society, Washington, DC, 1994, 464. [all data]