Ga19As19

Gas phase ion energetics data

Data compiled by: John E. Bartmess

Electron affinity determinations

EA (eV) Method Reference Comment
3.60 ± 0.10LPESJin, Taylor, et al., 1990EA=Vertical Detachment Energy. Poor mass resolution means ion=mixture of Ga(x)As(y), x+y=3

References

Jin, Taylor, et al., 1990
Jin, C.; Taylor, K.J.; Conceicao, J.; Smalley, R.E., Ultraviolet Photoelectron Spectra of Gallium Arsenide Clusters., Chem. Phys. Lett., 1990, 175, 1-2, 17, https://doi.org/10.1016/0009-2614(90)85511-A . [all data]