(E,Z,Z)-2,4,7-tridecatrienal

Van Den Dool and Kratz RI, non-polar column, custom temperature program

View large format table.

Column type Active phase I Reference Comment
CapillaryDB-51589.Lin and Blank, 200330. m/0.32 mm/0.25 μm, He; Program: 20C => 70C/min => 50C => 4C/min => 180C => 10C/min => 240C(10min)
CapillaryDB-51584.Blank, Lin, et al., 200130. m/0.32 mm/0.25 μm, He; Program: 20C => 70C/min => 50C => 4C/min => 180C => 10C/min => 240C(10min)

References

Lin and Blank, 2003
Lin, J.; Blank, I., Odorans generated by thermally induced degradation of phospholipids, J. Agric. Food Chem., 2003, 51, 15, 4364-4369, https://doi.org/10.1021/jf034300m . [all data]

Blank, Lin, et al., 2001
Blank, I.; Lin, J.; Arce Vera, F.; Welti, D.H.; Fay, L.B., Identification of potent odorants formed by autoxidation of arachidonic acid: structure elucidation and synthesis of (E,Z,Z)-2,4,7-tridecatrienal, J. Agric. Food Chem., 2001, 49, 6, 2959-2965, https://doi.org/10.1021/jf010160+ . [all data]