(2H3)ammonia

Phase change data

Data compiled by: Thermodynamics Research Center, NIST Boulder Laboratories, Chris Muzny director

Quantity Value Units Method Reference Comment
Tfus199.KN/ATaylor and Jungers, 1933Uncertainty assigned by TRC = 0.5 K

In addition to the Thermodynamics Research Center (TRC) data available from this site, much more physical and chemical property data is available from the following TRC products:

Vibrational and/or electronic energy levels

Data compiled by: Takehiko Shimanouchi

Symmetry:   C     Symmetry Number σ = 3

 Sym.   No   Approximate   Selected Freq.  Infrared   Raman   Comments
 Species   type of mode   Value   Rating   Value  Phase  Value  Phase

a1 1 Sym str 2420  C 2420.1 gas symmetric level (- )FR(2ν4)
a1 1 Sym str 2420  C 2420.6 gas antisymmetric level (- )FR(2ν4)
a1 2 Sym deform 748  B 745.7 gas symmetric level
a1 2 Sym deform 748  B 749.4 gas antisymmetric level
e 3 Deg str 2564  A 2564 gas
e 4 Deg deform 1191  B 1191 gas

Source: Shimanouchi, 1972

References

Taylor and Jungers, 1933
Taylor, H.S.; Jungers, J.C., The Deuteroammonias, J. Am. Chem. Soc., 1933, 55, 5057-8. [all data]

Shimanouchi, 1972
Shimanouchi, T., Tables of Molecular Vibrational Frequencies Consolidated Volume I, National Bureau of Standards, 1972, 1-160. [all data]