Cyclohexene, 1-chloro-4-(1-chloroethenyl)-

Normal alkane RI, non-polar column, temperature ramp

Data compiled by: NIST Mass Spectrometry Data Center, William E. Wallace, director

Column type Capillary
Active phase Ultra-ALLOY-5
Column length (m) 30.
Carrier gas
Substrate
Column diameter (mm) 0.25
Phase thickness (μm) 0.25
Tstart (C) 40.
Tend (C) 320.
Heat rate (K/min) 20.
Initial hold (min) 2.
Final hold (min) 13.
I 1259.
ReferenceTsuge, Ohtan, et al., 2011
Comment MSDC-RI

References

Tsuge, Ohtan, et al., 2011
Tsuge, S.; Ohtan, H.; Watanabe, C., Pyrolysis - GC/MS Data Book of Synthetic Polymers, Elsevier, 2011, 420. [all data]