HWO4

Gas phase ion energetics data

Data compiled by: John E. Bartmess

Electron affinity determinations

EA (eV) Method Reference Comment
>3.69996LPDWalter, Hertzler, et al., 1991No detachment observed at 3.7 eV, see also WO3-.

References

Walter, Hertzler, et al., 1991
Walter, C.W.; Hertzler, C.F.; Devynck, P.; Smith, G.P.; Peterson, J.R., Photodetachment of WO3-, J. Chem. Phys., 1991, 95, 2, 824, https://doi.org/10.1063/1.461089 . [all data]