Mercury nonamer

Gas phase ion energetics data

Data compiled by: Sharon G. Lias, Rhoda D. Levin, and Sherif A. Kafafi

Ionization energy determinations

IE (eV) Method Reference
8.25 ± 0.08EICabaud, Hoareau, et al., 1980

References

Cabaud, Hoareau, et al., 1980
Cabaud, B.; Hoareau, A.; Melinon, P., Time-of-flight spectroscopy of a supersonic beam of mercury. Intensities and appearance potentials of Hg aggregates, J. Phys. D:, 1980, 13, 1831. [all data]