fluorosilane

Gas phase thermochemistry data

Quantity Value Units Method Reference Comment
Δfgas-376.56kJ/molReviewChase, 1998Data last reviewed in June, 1976
Quantity Value Units Method Reference Comment
gas,1 bar238.39J/mol*KReviewChase, 1998Data last reviewed in June, 1976

Gas Phase Heat Capacity (Shomate Equation)

Cp° = A + B*t + C*t2 + D*t3 + E/t2
H° − H°298.15= A*t + B*t2/2 + C*t3/3 + D*t4/4 − E/t + F − H
S° = A*ln(t) + B*t + C*t2/2 + D*t3/3 − E/(2*t2) + G
    Cp = heat capacity (J/mol*K)
    H° = standard enthalpy (kJ/mol)
    S° = standard entropy (J/mol*K)
    t = temperature (K) / 1000.

View plot Requires a JavaScript / HTML 5 canvas capable browser.

View table.

Temperature (K) 298. - 1200.1200. - 6000.
A 13.47867100.5595
B 146.62453.995297
C -95.12157-0.777847
D 23.620270.052302
E -0.194815-16.28927
F -386.9581-444.3031
G 213.9133309.2461
H -376.5604-376.5604
ReferenceChase, 1998Chase, 1998
Comment Data last reviewed in June, 1976 Data last reviewed in June, 1976

Phase change data

Data compiled by: William E. Acree, Jr., James S. Chickos

Enthalpy of vaporization

ΔvapH (kcal/mol) Temperature (K) Reference Comment
4.42156.Emel«65533»us and Maddock, 1944Based on data from 145. - 167. K.

Vibrational and/or electronic energy levels

Data compiled by: Takehiko Shimanouchi

Symmetry:   C     Symmetry Number σ = 3

 Sym.   No   Approximate   Selected Freq.  Infrared   Raman   Comments
 Species   type of mode   Value   Rating   Value  Phase  Value  Phase

a1 1 SiH3 s-str 2206  D 2206 gas OV4)
a1 2 SiH3 s-deform 990  C 990 S gas
a1 3 SiF str 872  B 872 M gas
e 4 SiH3 d-str 2196  C 2196 M gas
e 5 SiH3 d-deform 956  C 956 M gas Band center reestimated by Duncan on basis of the data of Newman
e 6 SiH3 rock 728  B 728.1 M gas

Source: Shimanouchi, 1972

References

Chase, 1998
Chase, M.W., Jr., NIST-JANAF Themochemical Tables, Fourth Edition, J. Phys. Chem. Ref. Data, Monograph 9, 1998, 1-1951. [all data]