Europium tungsten tetraoxide

Gas phase ion energetics data

Data compiled by: Sharon G. Lias, Rhoda D. Levin, and Sherif A. Kafafi

Ionization energy determinations

IE (eV) Method Reference
10.1EIBalducci, Gigli, et al., 1981

References

Balducci, Gigli, et al., 1981
Balducci, G.; Gigli, G.; Guido, M., Dissociation energies of the molecules CrPO2(g) and CoO(g) by high-temperature mass spectrometry, J. Chem. Soc. Faraday Trans. 2, 1981, 77, 1107. [all data]