Tribromochlorogermane

Gas phase ion energetics data

Data compiled by: Henry M. Rosenstock, Keith Draxl, Bruce W. Steiner, and John T. Herron

Appearance energy determinations

Ion AE (eV) Other Products MethodReferenceComment
GeClBr2+14. ± 1.BrEIUy, Muenow, et al., 1969

References

Uy, Muenow, et al., 1969
Uy, O.M.; Muenow, D.W.; Margrave, J.L., Mass spectrometric studies at high temperatures. Part 35. Stabilities of gaseous GeCl2 and GeBr2, J. Chem. Soc. Faraday Trans., 1969, 65, 1296. [all data]