2,4(1H,3H)-Pyrimidinedione, 1,3,6-trimethyl-

Phase change data

Data compiled as indicated in comments:
TRC - Thermodynamics Research Center, NIST Boulder Laboratories, Chris Muzny director
AC - William E. Acree, Jr., James S. Chickos
DH - Eugene S. Domalski and Elizabeth D. Hearing

Quantity Value Units Method Reference Comment
Tfus384.5KN/AZielenkiewicz, Zielenkiewicz, et al., 1984Uncertainty assigned by TRC = 0.5 K; TRC

Enthalpy of sublimation

ΔsubH (kJ/mol) Temperature (K) Method Reference Comment
106.7 ± 2.5320.QRTeplitsky, Yanson, et al., 1980Based on data from 300. - 340. K.; AC

Enthalpy of fusion

ΔfusH (kJ/mol) Temperature (K) Reference Comment
21.200384.5Zielenkiewicz, Zielenkiewicz, et al., 1984, 2DH
21.2384.5Domalski and Hearing, 1996AC

Entropy of fusion

ΔfusS (J/mol*K) Temperature (K) Reference Comment
55.1384.5Zielenkiewicz, Zielenkiewicz, et al., 1984, 2DH

In addition to the Thermodynamics Research Center (TRC) data available from this site, much more physical and chemical property data is available from the following TRC products:

References

Zielenkiewicz, Zielenkiewicz, et al., 1984
Zielenkiewicz, A.; Zielenkiewicz, W.; Malanowski, S., Thermodynamic Excess Functions of Dilute Aqueous Solutions of Alkylated Pyrimidines and Aminopurines and Caffeine, Thermochim. Acta, 1984, 74, 95. [all data]

Teplitsky, Yanson, et al., 1980
Teplitsky, A.B.; Yanson, I.K.; Glukhova, O.T.; Zielenkiwicz, A.; Zielenkiewicz, W.; Wierzchowski, K.L., Thermochemistry of aqueous solutions of alkylated nucleic acid bases, Biophysical Chemistry, 1980, 11, 1, 17-21, https://doi.org/10.1016/0301-4622(80)85003-4 . [all data]

Zielenkiewicz, Zielenkiewicz, et al., 1984, 2
Zielenkiewicz, A.; Zielenkiewicz, W.; Malanowski, S., Thermodynamic excess functions of diluted aqueous solutions of alkylated pyrimidines and amino purines, and caffeine, Thermochim. Acta, 1984, 74, 95-111. [all data]

Domalski and Hearing, 1996
Domalski, Eugene S.; Hearing, Elizabeth D., Heat Capacities and Entropies of Organic Compounds in the Condensed Phase. Volume III, J. Phys. Chem. Ref. Data, 1996, 25, 1, 1, https://doi.org/10.1063/1.555985 . [all data]