Benzaldehyde, 2-methoxy-

Phase change data

Data compiled as indicated in comments:
BS - Robert L. Brown and Stephen E. Stein
TRC - Thermodynamics Research Center, NIST Boulder Laboratories, Chris Muzny director

Quantity Value Units Method Reference Comment
Tboil511.2KN/AAldrich Chemical Company Inc., 1990BS
Tboil516.7KN/AWeast and Grasselli, 1989BS
Tboil516.KN/AAmerican Tokyo Kasei, 1988BS
Tboil516.15KN/APerkin, 1896Uncertainty assigned by TRC = 1.5 K; TRC
Quantity Value Units Method Reference Comment
Tfus308.15KN/APerkin, 1896Uncertainty assigned by TRC = 0.5 K; TRC

In addition to the Thermodynamics Research Center (TRC) data available from this site, much more physical and chemical property data is available from the following TRC products:

References

Aldrich Chemical Company Inc., 1990
Aldrich Chemical Company Inc., Catalog Handbook of Fine Chemicals, Aldrich Chemical Company, Inc., Milwaukee WI, 1990, 1. [all data]

Weast and Grasselli, 1989
CRC Handbook of Data on Organic Compounds, 2nd Editon, Weast,R.C and Grasselli, J.G., ed(s)., CRC Press, Inc., Boca Raton, FL, 1989, 1. [all data]

American Tokyo Kasei, 1988
American Tokyo Kasei, TCI American Organic Chemical 88/89 Catalog, American Tokyo Kasei, Portland, OR, 1988, 1610. [all data]

Perkin, 1896
Perkin, W.H., LXIX. On Magnetic Rotatory Power, especially of Aromatic Compounds, J. Chem. Soc., 1896, 69, 1025-1257. [all data]