hafnium tetrachloride

Phase change data

Data compiled as indicated in comments:
TRC - Thermodynamics Research Center, NIST Boulder Laboratories, Chris Muzny director
AC - William E. Acree, Jr., James S. Chickos

Quantity Value Units Method Reference Comment
Tc722.4KN/ADenisova, Safronova, et al., 1967Uncertainty assigned by TRC = 0.5 K; TRC
Tc725.7KN/ANisel'son, Sokolova, et al., 1967Uncertainty assigned by TRC = 0.72 K; TRC
Quantity Value Units Method Reference Comment
Pc57.80barN/ADenisova, Safronova, et al., 1967Uncertainty assigned by TRC = 0.57 bar; TRC
Pc54.20barN/ANisel'son, Sokolova, et al., 1967Uncertainty assigned by TRC = 0.54 bar; TRC
Quantity Value Units Method Reference Comment
ρc3.184mol/lN/ANisel'son, Sokolova, et al., 1967Uncertainty assigned by TRC = 0.031 mol/l; TRC

Enthalpy of sublimation

ΔsubH (kJ/mol) Temperature (K) Method Reference Comment
97.9 ± 1.2499.TTangri and Bose, 1994Based on data from 398. - 500. K.; AC
107.9 ± 0.8353. - 433.N/AIzmailovich, Khodeev, et al., 1973AC

In addition to the Thermodynamics Research Center (TRC) data available from this site, much more physical and chemical property data is available from the following TRC products:

References

Denisova, Safronova, et al., 1967
Denisova, N.D.; Safronova, E.K.; Pustil'nik, A.I.; Bystrova, O.N., Boundary Liqui-Vapor Curve and Saturated Vapour Pressure of Zirconium and Hafnium Tetrachlorides, Russ. J. Phys. Chem. (Engl. Transl.), 1967, 41, 30. [all data]

Nisel'son, Sokolova, et al., 1967
Nisel'son, L.A.; Sokolova, T.D.; Stolyarov, V.I., Some Properties of Hafnium Tetrachloride in the Liquid and Vapor States, Russ. J. Phys. Chem. (Engl. Transl.), 1967, 41, 884. [all data]

Tangri and Bose, 1994
Tangri, R.P.; Bose, D.K., Vapour pressure measurement of zirconium chloride and hafnium chloride by the transpiration technique, Thermochimica Acta, 1994, 244, 249-256, https://doi.org/10.1016/0040-6031(94)80224-6 . [all data]

Izmailovich, Khodeev, et al., 1973
Izmailovich, A.S.; Khodeev, Y.S.; Tsirel'nikov, V.I., Zh. Fiz. Khim., 1973, 47, 1565. [all data]